Reaction Details
TargetCytochrome P450 2C9
LigandBDBM50241343
Substrate/Competitorn/a
Meas. Tech.ChEMBL_51556 (CHEMBL661229)
Ki 45000±n/a nM
Citation Afzelius, LZamora, IMasimirembwa, CMKarlén, AAndersson, TBMecucci, SBaroni, MCruciani, G Conformer- and alignment-independent model for predicting structurally diverse competitive CYP2C9 inhibitors. J Med Chem47:907-14 (2004) 
 
Cytochrome P450 2C9
Name:Cytochrome P450 2C9
Type:Enzyme
Mol. Mass.:55636.33
Organism:Homo sapiens (Human)
Description:P11712
Residue:490
BDBM50241343
NameBDBM50241343
Synonyms:(RS)-6-methoxy-2-((4-methoxy-3,5-dimethylpyridin-2-yl) methylsulfinyl)-1H-benzo[d]imidazole 2-(3-methoxy-2,4-dimethylbenzylsulfinyl)-6-methoxy-1H-benzo[d]imidazole 5-Methoxy-2-(4-methoxy-3,5-dimethyl-pyridin-2-ylmethanesulfinyl)-1H-benzoimidazole (omeprazole) 5-methoxy-2-((4-methoxy-3,5-dimethylpyridin-2-yl)methylsulfinyl)-1H-benzo[d]imidazole 6-methoxy-2-((4-methoxy-3,5-dimethylpyridin-2-yl)methylsulfinyl)-1H-benzo[d]imidazole ESOMEPRAZOLE SODIUM OMEPRAZOLE Prilosec | cid_4594
TypeSmall organic molecule
Emp. Form.C17H19N3O3S
Mol. Mass.345.416
SMILESCOc1ccc2nc([nH]c2c1)S(=O)Cc1ncc(C)c(OC)c1C