Reaction Details
TargetCytochrome P450 2C9
LigandBDBM50139805
Substrate/Competitorn/a
Meas. Tech.ChEMBL_51556 (CHEMBL661229)
Ki 35000±n/a nM
Citation Afzelius, LZamora, IMasimirembwa, CMKarlén, AAndersson, TBMecucci, SBaroni, MCruciani, G Conformer- and alignment-independent model for predicting structurally diverse competitive CYP2C9 inhibitors. J Med Chem47:907-14 (2004) 
 
Cytochrome P450 2C9
Name:Cytochrome P450 2C9
Type:Enzyme
Mol. Mass.:55636.33
Organism:Homo sapiens (Human)
Description:P11712
Residue:490
BDBM50139805
NameBDBM50139805
Synonyms:5-Methoxy-2-(4-methoxy-3,5-dimethyl-pyridin-2-ylmethanesulfonyl)-1H-benzoimidazole Omeprazole sulfone
TypeSmall organic molecule
Emp. Form.C17H19N3O4S
Mol. Mass.361.415
SMILESCOc1ccc2nc([nH]c2c1)S(=O)(=O)Cc1ncc(C)c(OC)c1C