Reaction Details
TargetCytochrome P450 2C9
LigandBDBM50090677
Substrate/Competitorn/a
Meas. Tech.ChEMBL_51556 (CHEMBL661229)
Ki 500±n/a nM
Citation Afzelius, LZamora, IMasimirembwa, CMKarlén, AAndersson, TBMecucci, SBaroni, MCruciani, G Conformer- and alignment-independent model for predicting structurally diverse competitive CYP2C9 inhibitors. J Med Chem47:907-14 (2004) 
 
Cytochrome P450 2C9
Name:Cytochrome P450 2C9
Type:Enzyme
Mol. Mass.:55636.33
Organism:Homo sapiens (Human)
Description:P11712
Residue:490
BDBM50090677
NameBDBM50090677
Synonyms:4-Amino-N-(2-phenyl-2H-pyrazol-3-yl)-benzenesulfonamide CHEMBL1109 Sulfabid US9180183, Sulfaphenazole
TypeSmall organic molecule
Emp. Form.C15H14N4O2S
Mol. Mass.314.362
SMILESNc1ccc(cc1)S(=O)(=O)Nc1ccnn1-c1ccccc1