Reaction Details
TargetCytochrome P450 2C9
LigandBDBM50003655
Substrate/Competitorn/a
Meas. Tech.ChEMBL_51556 (CHEMBL661229)
Ki 6000±n/a nM
Citation Afzelius, LZamora, IMasimirembwa, CMKarlén, AAndersson, TBMecucci, SBaroni, MCruciani, G Conformer- and alignment-independent model for predicting structurally diverse competitive CYP2C9 inhibitors. J Med Chem47:907-14 (2004) 
 
Cytochrome P450 2C9
Name:Cytochrome P450 2C9
Type:Enzyme
Mol. Mass.:55636.33
Organism:Homo sapiens (Human)
Description:P11712
Residue:490
BDBM50003655
NameBDBM50003655
Synonyms:Phenytoin
TypeSmall organic molecule
Emp. Form.C15H12N2O2
Mol. Mass.252.268
SMILESO=C1NC(=O)C(N1)(c1ccccc1)c1ccccc1