Reaction Details
TargetCytochrome P450 2C9
LigandBDBM50409891
Substrate/Competitorn/a
Meas. Tech.ChEMBL_51556 (CHEMBL661229)
Ki 93000±n/a nM
Citation Afzelius, LZamora, IMasimirembwa, CMKarlén, AAndersson, TBMecucci, SBaroni, MCruciani, G Conformer- and alignment-independent model for predicting structurally diverse competitive CYP2C9 inhibitors. J Med Chem47:907-14 (2004) 
 
Cytochrome P450 2C9
Name:Cytochrome P450 2C9
Type:Enzyme
Mol. Mass.:55636.33
Organism:Homo sapiens (Human)
Description:P11712
Residue:490
BDBM50409891
NameBDBM50409891
Synonyms:CHEMBL2110340
TypeSmall organic molecule
Emp. Form.C17H16FN3O2S
Mol. Mass.345.391
SMILESFc1ccc2nc([nH]c2c1)[S@](=O)Cc1cc(OCC2CC2)ccn1