Reaction Details
TargetMelanocyte-stimulating hormone receptor
LigandBDBM50252861
Substrate/Competitorn/a
Meas. Tech.ChEMBL_105694 (CHEMBL718208)
EC50 100±n/a nM
Citation Han, GHaskell-Luevano, CKendall, LBonner, GHadley, MECone, RDHruby, VJ De novo design, synthesis, and pharmacology of alpha-melanocyte stimulating hormone analogues derived from somatostatin by a hybrid approach. J Med Chem47:1514-26 (2004) 
 
Melanocyte-stimulating hormone receptor
Name:Melanocyte-stimulating hormone receptor
Type:Enzyme
Mol. Mass.:34717.23
Organism:Homo sapiens (Human)
Description:Q01726
Residue:317
BDBM50252861
NameBDBM50252861
Synonyms:CHEMBL507214 | H-D-Phe-c[Cys-Tyr-DTrp-Orn-Thr-Pen]-Thr-NH2
TypeSmall organic molecule
Emp. Form.C50H67N11O11S2
Mol. Mass.1062.264
SMILESC[C@@H](O)[C@H](NC(=O)[C@H]1NC(=O)[C@@H](NC(=O)[C@H](CCCN)NC(=O)[C@@H](Cc2c[nH]c3ccccc23)NC(=O)[C@H](Cc2ccc(O)cc2)NC(=O)[C@H](CSSC1(C)C)NC(=O)[C@H](N)Cc1ccccc1)[C@@H](C)O)C(N)=O