Reaction Details
TargetMelanocortin receptor 5
LigandBDBM50141027
Substrate/Competitorn/a
Meas. Tech.ChEMBL_106669 (CHEMBL714653)
EC50 0.110000±n/a nM
Citation Han, GHaskell-Luevano, CKendall, LBonner, GHadley, MECone, RDHruby, VJ De novo design, synthesis, and pharmacology of alpha-melanocyte stimulating hormone analogues derived from somatostatin by a hybrid approach. J Med Chem47:1514-26 (2004) 
 
Melanocortin receptor 5
Name:Melanocortin receptor 5
Type:Enzyme
Mol. Mass.:36966.58
Organism:Mus musculus (Mouse)
Description:P41149
Residue:325
BDBM50141027
NameBDBM50141027
Synonyms:1N-(1-carbamoyl-2-hydroxypropyl)-15-[3-amino(imino)methylaminopropyl]-6-(1-amino-2-phenylethylcarboxamido)-12-(4-chlorobenzyl)-9-(1H-5-imidazolylmethyl)-18-(1H-3-indolylmethyl)-7,10,13,16,19-pentaoxo-3,4-dithia-8,11,14,17,20-pentaazacycloicosane- | CHEMBL406842
TypeSmall organic molecule
Emp. Form.C51H64ClN15O9S2
Mol. Mass.1130.732
SMILESC[C@H](O)[C@@H](NC(=O)[C@H]1CSSC[C@H](NC(=O)[C@H](N)Cc2ccccc2)C(=O)N[C@@H](Cc2cnc[nH]2)C(=O)N[C@@H](Cc2ccc(Cl)cc2)C(=O)N[C@@H](CCCNC(N)=N)C(=O)N[C@H](Cc2c[nH]c3ccccc23)C(=O)N1)C(N)=O