Reaction Details
TargetB2 bradykinin receptor
LigandBDBM50142954
Substrate/Competitorn/a
Meas. Tech.ChEMBL_40272 (CHEMBL656507)
IC50 3±n/a nM
Citation Sawada, YKayakiri, HAbe, YImai, KMizutani, TInamura, NAsano, MAramori, IHatori, CKatayama, AOku, TTanaka, H A new series of highly potent non-peptide bradykinin B2 receptor antagonists incorporating the 4-heteroarylquinoline framework. Improvement of aqueous solubility and new insights into species difference. J Med Chem47:1617-30 (2004) 
 
B2 bradykinin receptor
Name:B2 bradykinin receptor
Type:Enzyme Catalytic Domain
Mol. Mass.:44467.17
Organism:Homo sapiens (Human)
Description:B2 BRADYKININ BDKRB2 HUMAN::P30411
Residue:391
BDBM50142954
NameBDBM50142954
Synonyms:4-[(E)-2-({1-[2,4-Dichloro-3-(4-imidazol-1-yl-2-methyl-quinolin-8-yloxymethyl)-phenyl]-1H-pyrrol-2-ylmethyl}-carbamoyl)-vinyl]-N,N-dimethyl-benzamide; dihydrochloride | CHEMBL538233
TypeSmall organic molecule
Emp. Form.C37H32Cl2N6O3
Mol. Mass.679.594
SMILESCN(C)C(=O)c1ccc(\C=C\C(=O)NCc2cccn2-c2ccc(Cl)c(COc3cccc4c(cc(C)nc34)-n3ccnc3)c2Cl)cc1