Reaction Details
TargetInterstitial collagenase
LigandBDBM50088118
Substrate/Competitorn/a
Meas. Tech.ChEMBL_106147 (CHEMBL718694)
Ki 5±n/a nM
Citation Källblad, PTodorov, NPWillems, HMAlberts, IL Receptor flexibility in the in silico screening of reagents in the S1' pocket of human collagenase. J Med Chem47:2761-7 (2004) 
 
Interstitial collagenase
Name:Interstitial collagenase
Type:Enzyme
Mol. Mass.:54010.26
Organism:Homo sapiens (Human)
Description: P03956
Residue:469
BDBM50088118
NameBDBM50088118
Synonyms:2-(N-(4-nitrobenzyl)-2,3,4,5,6-pentafluorophenylsulfonamido)-N-hydroxyacetamide N-Hydroxy-2-[(4-nitro-benzyl)-pentafluorobenzenesulfonyl-amino]-acetamide
TypeSmall organic molecule
Emp. Form.C15H10F5N3O6S
Mol. Mass.455.313
SMILESONC(=O)CN(Cc1ccc(cc1)[N+]([O-])=O)S(=O)(=O)c1c(F)c(F)c(F)c(F)c1F