Reaction Details
TargetCarbonic anhydrase 9
LigandBDBM50153969
Substrate/Competitorn/a
Meas. Tech.ChEMBL_302882 (CHEMBL828796)
Ki 1.1±n/a nM
Citation Garaj, VPuccetti, LFasolis, GWinum, JYMontero, JLScozzafava, AVullo, DInnocenti, ASupuran, CT Carbonic anhydrase inhibitors: synthesis and inhibition of cytosolic/tumor-associated carbonic anhydrase isozymes I, II, and IX with sulfonamides incorporating 1,2,4-triazine moieties. Bioorg Med Chem Lett14:5427-33 (2004) 
 
Carbonic anhydrase 9
Name:Carbonic anhydrase 9
Type:Enzyme
Mol. Mass.:49669.03
Organism:Homo sapiens (Human)
Description:Catalytic domain of human cloned isozyme was used in the assay
Residue:459
BDBM50153969
NameBDBM50153969
Synonyms:4-[2-(4,6-Bis-methylamino-[1,3,5]triazin-2-ylamino)-ethyl]-benzenesulfonamide | CHEMBL184107
TypeSmall organic molecule
Emp. Form.C13H19N7O2S
Mol. Mass.337.401
SMILESCNc1nc(NC)nc(NCCc2ccc(cc2)S(N)(=O)=O)n1