Reaction Details
TargetCarbonic anhydrase 2
LigandBDBM50153970
Substrate/Competitorn/a
Meas. Tech.ChEMBL_302881 (CHEMBL828795)
Ki 20±n/a nM
Citation Garaj, VPuccetti, LFasolis, GWinum, JYMontero, JLScozzafava, AVullo, DInnocenti, ASupuran, CT Carbonic anhydrase inhibitors: synthesis and inhibition of cytosolic/tumor-associated carbonic anhydrase isozymes I, II, and IX with sulfonamides incorporating 1,2,4-triazine moieties. Bioorg Med Chem Lett14:5427-33 (2004) 
 
Carbonic anhydrase 2
Name:Carbonic anhydrase 2
Type:Enzyme
Mol. Mass.:29250.71
Organism:Homo sapiens (Human)
Description:P00918
Residue:260
BDBM50153970
NameBDBM50153970
Synonyms:4-(4,6-Diethoxy-[1,3,5]triazin-2-ylamino)-benzenesulfonamide | CHEMBL363543
TypeSmall organic molecule
Emp. Form.C13H17N5O4S
Mol. Mass.339.37
SMILESCCOc1nc(Nc2ccc(cc2)S(N)(=O)=O)nc(OCC)n1