Reaction Details
TargetCarbonic anhydrase 9
LigandBDBM50153971
Substrate/Competitorn/a
Meas. Tech.ChEMBL_302882 (CHEMBL828796)
Ki 0.15±n/a nM
Citation Garaj, VPuccetti, LFasolis, GWinum, JYMontero, JLScozzafava, AVullo, DInnocenti, ASupuran, CT Carbonic anhydrase inhibitors: synthesis and inhibition of cytosolic/tumor-associated carbonic anhydrase isozymes I, II, and IX with sulfonamides incorporating 1,2,4-triazine moieties. Bioorg Med Chem Lett14:5427-33 (2004) 
 
Carbonic anhydrase 9
Name:Carbonic anhydrase 9
Type:Enzyme
Mol. Mass.:49669.03
Organism:Homo sapiens (Human)
Description:Catalytic domain of human cloned isozyme was used in the assay
Residue:459
BDBM50153971
NameBDBM50153971
Synonyms:4-(4,6-Dichloro-[1,3,5]triazin-2-ylamino)-benzenesulfonamide CHEMBL366069
TypeSmall organic molecule
Emp. Form.C9H7Cl2N5O2S
Mol. Mass.320.155
SMILESNS(=O)(=O)c1ccc(Nc2nc(Cl)nc(Cl)n2)cc1