Reaction Details
TargetCarbonic anhydrase 2
LigandBDBM50155545
Substrate/Competitorn/a
Meas. Tech.ChEMBL_302866 (CHEMBL828781)
Ki 0.7±n/a nM
Citation Cecchi, AWinum, JYInnocenti, AVullo, DMontero, JLScozzafava, ASupuran, CT Carbonic anhydrase inhibitors: synthesis and inhibition of cytosolic/tumor-associated carbonic anhydrase isozymes I, II, and IX with sulfonamides derived from 4-isothiocyanato-benzolamide. Bioorg Med Chem Lett14:5775-80 (2004) 
 
Carbonic anhydrase 2
Name:Carbonic anhydrase 2
Type:Enzyme
Mol. Mass.:29250.71
Organism:Homo sapiens (Human)
Description:P00918
Residue:260
BDBM50155545
NameBDBM50155545
Synonyms:5-{4-[3-(4-Methyl-piperazin-1-yl)-thioureido]-benzenesulfonylamino}-[1,3,4]thiadiazole-2-sulfonic acid amide | CHEMBL363931
TypeSmall organic molecule
Emp. Form.C14H20N8O4S4
Mol. Mass.492.62
SMILESCN1CCN(CC1)NC(=S)Nc1ccc(cc1)S(=O)(=O)Nc1nnc(s1)S(N)(=O)=O