Reaction Details
TargetPutative alpha-glucosidase
LigandBDBM18351
Substrate/Competitorn/a
Meas. Tech.ChEMBL_304920 (CHEMBL827812)
IC50 50±n/a nM
Citation Godin, GCompain, PMartin, ORIkeda, KYu, LAsano, N Alpha-1-C-alkyl-1-deoxynojirimycin derivatives as potent and selective inhibitors of intestinal isomaltase: remarkable effect of the alkyl chain length on glycosidase inhibitory profile. Bioorg Med Chem Lett14:5991-5 (2004) 
 
Putative alpha-glucosidase
Name:Putative alpha-glucosidase
Synonyms:Alpha-glucosidase
Type:PROTEIN
Mol. Mass.:102549.55
Organism:Oryza sativa subsp. japonica
Description:ChEMBL_304920
Residue:929
BDBM18351
NameBDBM18351
Typenatural product
Emp. Form.C6H13NO4
Mol. Mass.163.1717
SMILESOC[C@H]1NC[C@H](O)[C@@H](O)[C@@H]1O