Reaction Details
TargetNeuronal acetylcholine receptor subunit alpha-4/beta-2
LigandBDBM50167456
Substrate/Competitorn/a
Meas. Tech.ChEMBL_303488 (CHEMBL838862)
Ki 6.5±n/a nM
Citation Coe, JWVetelino, MGBashore, CGWirtz, MCBrooks, PRArnold, EPLebel, LAFox, CBSands, SBDavis, TISchulz, DWRollema, HTingley, FDO'Neill, BT In pursuit of alpha4beta2 nicotinic receptor partial agonists for smoking cessation: carbon analogs of (-)-cytisine. Bioorg Med Chem Lett15:2974-9 (2005) 
 
Neuronal acetylcholine receptor subunit alpha-4/beta-2
Name:Neuronal acetylcholine receptor subunit alpha-4/beta-2
Type:Protein
Mol. Mass.:n/a
Description:n/a
Components:This complex has 2 components.
Component 1
Name:Neuronal acetylcholine receptor subunit alpha-4
Synonyms:ACHA4_HUMAN CHRNA4 protein Neuronal acetylcholine receptor protein alpha-4 subunit Nicotinic acetylcholine receptor alpha4/beta2/alpha5
Type:n/a
Mol. Mass.:69963.49
Organism:Homo sapiens (Human)
Description:NACHRA4
Residue:627
Component 2
Name:Neuronal acetylcholine receptor subunit beta-2
Synonyms:ACHB2_HUMAN Neuronal acetylcholine receptor protein beta-2 subunit | Nicotinic acetylcholine receptor alpha3/beta2/alpha5
Type:Protein
Mol. Mass.:57020.50
Organism:Homo sapiens (Human)
Description:P17787
Residue:502
BDBM50167456
NameBDBM50167456
Synonyms:6-Fluoro-11-aza-tricyclo[7.3.1.0*2,7*]trideca-2,4,6-triene | CHEMBL191988
TypeSmall organic molecule
Emp. Form.C12H14FN
Mol. Mass.191.2447
SMILESFc1cccc2C3CNCC(C3)Cc12