Reaction Details
TargetCarbonic anhydrase 2
LigandBDBM50167337
Substrate/Competitorn/a
Meas. Tech.ChEMBL_302314 (CHEMBL828903)
Ki 28±n/a nM
Citation Garaj, VPuccetti, LFasolis, GWinum, JYMontero, JLScozzafava, AVullo, DInnocenti, ASupuran, CT Carbonic anhydrase inhibitors: novel sulfonamides incorporating 1,3,5-triazine moieties as inhibitors of the cytosolic and tumour-associated carbonic anhydrase isozymes I, II and IX. Bioorg Med Chem Lett15:3102-8 (2005) 
 
Carbonic anhydrase 2
Name:Carbonic anhydrase 2
Type:Enzyme
Mol. Mass.:29250.71
Organism:Homo sapiens (Human)
Description:P00918
Residue:260
BDBM50167337
NameBDBM50167337
Synonyms:3-{4-Chloro-6-[2-(4-sulfamoyl-phenyl)-ethylamino]-[1,3,5]triazin-2-ylamino}-propionic acid | CHEMBL190024
TypeSmall organic molecule
Emp. Form.C14H17ClN6O4S
Mol. Mass.400.841
SMILESNS(=O)(=O)c1ccc(CCNc2nc(Cl)nc(NCCC(O)=O)n2)cc1