Reaction Details
TargetCarbonic anhydrase 2
LigandBDBM50167327
Substrate/Competitorn/a
Meas. Tech.ChEMBL_302314 (CHEMBL828903)
Ki 29±n/a nM
Citation Garaj, VPuccetti, LFasolis, GWinum, JYMontero, JLScozzafava, AVullo, DInnocenti, ASupuran, CT Carbonic anhydrase inhibitors: novel sulfonamides incorporating 1,3,5-triazine moieties as inhibitors of the cytosolic and tumour-associated carbonic anhydrase isozymes I, II and IX. Bioorg Med Chem Lett15:3102-8 (2005) 
 
Carbonic anhydrase 2
Name:Carbonic anhydrase 2
Type:Enzyme
Mol. Mass.:29250.71
Organism:Homo sapiens (Human)
Description:P00918
Residue:260
BDBM50167327
NameBDBM50167327
Synonyms:CHEMBL191045 | [4-Chloro-6-(4-sulfamoyl-benzylamino)-[1,3,5]triazin-2-ylamino]-acetic acid
TypeSmall organic molecule
Emp. Form.C12H13ClN6O4S
Mol. Mass.372.787
SMILESNS(=O)(=O)c1ccc(CNc2nc(Cl)nc(NCC(O)=O)n2)cc1