Reaction Details
TargetProstaglandin E2 receptor EP1 subtype
LigandBDBM50159758
Substrate/Competitorn/a
Meas. Tech.ChEMBL_302794 (CHEMBL839478)
Ki 13000±n/a nM
Citation Belley, MGallant, MRoy, BHoude, KLachance, NLabelle, MTrimble, LAChauret, NLi, CSawyer, NTremblay, NLamontagne, SCarrière, MCDenis, DGreig, GMSlipetz, DMetters, KMGordon, RChan, CCZamboni, RJ Structure-activity relationship studies on ortho-substituted cinnamic acids, a new class of selective EP(3) antagonists. Bioorg Med Chem Lett15:527-30 (2005) 
 
Prostaglandin E2 receptor EP1 subtype
Name:Prostaglandin E2 receptor EP1 subtype
Type:Enzyme
Mol. Mass.:41834.57
Organism:Homo sapiens (Human)
Description:P34995
Residue:402
BDBM50159758
NameBDBM50159758
Synonyms:3-(2-{(E)-3-[2-(2,6-Dichloro-benzyloxy)-3-methyl-phenyl]-3-hydroxy-propenyl}-phenyl)-acrylic acid | CHEMBL360290
TypeSmall organic molecule
Emp. Form.C26H22Cl2O4
Mol. Mass.469.356
SMILESCc1cccc(C(O)\C=C\c2ccccc2\C=C\C(O)=O)c1OCc1c(Cl)cccc1Cl