Reaction Details
TargetProstaglandin E2 receptor EP3 subtype
LigandBDBM50370468
Substrate/Competitorn/a
Meas. Tech.ChEMBL_302796 (CHEMBL839480)
Ki 11±n/a nM
Citation Belley, MGallant, MRoy, BHoude, KLachance, NLabelle, MTrimble, LAChauret, NLi, CSawyer, NTremblay, NLamontagne, SCarrière, MCDenis, DGreig, GMSlipetz, DMetters, KMGordon, RChan, CCZamboni, RJ Structure-activity relationship studies on ortho-substituted cinnamic acids, a new class of selective EP(3) antagonists. Bioorg Med Chem Lett15:527-30 (2005) 
 
Prostaglandin E2 receptor EP3 subtype
Name:Prostaglandin E2 receptor EP3 subtype
Type:Enzyme
Mol. Mass.:43335.03
Organism:Homo sapiens (Human)
Description:P43115
Residue:390
BDBM50370468
NameBDBM50370468
Synonyms:CHEMBL1237296
TypeSmall organic molecule
Emp. Form.C25H22O4
Mol. Mass.386.4398
SMILESOC(=O)\C=C\c1ccccc1C\C=C/c1cccc(O)c1OCc1ccccc1