Reaction Details
TargetProstaglandin E2 receptor EP2 subtype
LigandBDBM50370467
Substrate/Competitorn/a
Meas. Tech.ChEMBL_302795 (CHEMBL839479)
Ki 860±n/a nM
Citation Belley, MGallant, MRoy, BHoude, KLachance, NLabelle, MTrimble, LAChauret, NLi, CSawyer, NTremblay, NLamontagne, SCarrière, MCDenis, DGreig, GMSlipetz, DMetters, KMGordon, RChan, CCZamboni, RJ Structure-activity relationship studies on ortho-substituted cinnamic acids, a new class of selective EP(3) antagonists. Bioorg Med Chem Lett15:527-30 (2005) 
 
Prostaglandin E2 receptor EP2 subtype
Name:Prostaglandin E2 receptor EP2 subtype
Type:Enzyme
Mol. Mass.:39775.71
Organism:Homo sapiens (Human)
Description:P43116
Residue:358
BDBM50370467
NameBDBM50370467
Synonyms:CHEMBL1237295
TypeSmall organic molecule
Emp. Form.C26H24O3
Mol. Mass.384.467
SMILESCc1cccc(C\C=C\c2ccccc2\C=C\C(O)=O)c1OCc1ccccc1