Reaction Details
TargetProstaglandin E2 receptor EP2 subtype
LigandBDBM50159763
Substrate/Competitorn/a
Meas. Tech.ChEMBL_302795 (CHEMBL839479)
Ki 8±n/a nM
Citation Belley, MGallant, MRoy, BHoude, KLachance, NLabelle, MTrimble, LAChauret, NLi, CSawyer, NTremblay, NLamontagne, SCarrière, MCDenis, DGreig, GMSlipetz, DMetters, KMGordon, RChan, CCZamboni, RJ Structure-activity relationship studies on ortho-substituted cinnamic acids, a new class of selective EP(3) antagonists. Bioorg Med Chem Lett15:527-30 (2005) 
 
Prostaglandin E2 receptor EP2 subtype
Name:Prostaglandin E2 receptor EP2 subtype
Type:Enzyme
Mol. Mass.:39775.71
Organism:Homo sapiens (Human)
Description:P43116
Residue:358
BDBM50159763
NameBDBM50159763
Synonyms:(E)-3-{2-[(E)-2-(2-Benzyloxy-phenyl)-vinyl]-phenyl}-acrylic acid | CHEMBL181035
TypeSmall organic molecule
Emp. Form.C24H20O3
Mol. Mass.356.4138
SMILESOC(=O)\C=C\c1ccccc1\C=C\c1ccccc1OCc1ccccc1