Reaction Details
TargetEukaryotic translation initiation factor 4E
LigandBDBM50165117
Substrate/Competitorn/a
Meas. Tech.ChEMBL_305877 (CHEMBL831921)
IC50 180000±n/a nM
Citation Ghosh, PPark, CPeterson, MSBitterman, PBPolunovsky, VAWagner, CR Synthesis and evaluation of potential inhibitors of eIF4E cap binding to 7-methyl GTP. Bioorg Med Chem Lett15:2177-80 (2005) 
 
Eukaryotic translation initiation factor 4E
Name:Eukaryotic translation initiation factor 4E
Type:Protein
Mol. Mass.:25095.44
Organism:Homo sapiens (Human)
Description:P06730
Residue:217
BDBM50165117
NameBDBM50165117
Synonyms:2-amino-6-hydroxy-9-[(2R,4S,5R)-5-[(phosphinatooxy)methyl]-3,4-bis(propan-2-yloxy)oxolan-2-yl]-9H-purin-7-ium; triethylazanium
TypeSmall organic molecule
Emp. Form.C16H26N5O7P
Mol. Mass.431.3807
SMILESCC(C)O[C@H]1[C@@H](COP([O-])=O)O[C@H](C1OC(C)C)n1c[nH+]c2c1nc(N)[nH]c2=O