Reaction Details
TargetEukaryotic translation initiation factor 4E
LigandBDBM50165134
Substrate/Competitorn/a
Meas. Tech.ChEMBL_305877 (CHEMBL831921)
IC50>400000±n/a nM
Citation Ghosh, PPark, CPeterson, MSBitterman, PBPolunovsky, VAWagner, CR Synthesis and evaluation of potential inhibitors of eIF4E cap binding to 7-methyl GTP. Bioorg Med Chem Lett15:2177-80 (2005) 
 
Eukaryotic translation initiation factor 4E
Name:Eukaryotic translation initiation factor 4E
Type:Protein
Mol. Mass.:25095.44
Organism:Homo sapiens (Human)
Description:P06730
Residue:217
BDBM50165134
NameBDBM50165134
Synonyms:2-Amino-7-ethyl-9-((2R,4S,5R)-5-hydroxymethyl-3,4-diisopropoxy-tetrahydro-furan-2-yl)-6-oxo-6,9-dihydro-1H-purin-7-ium | CHEMBL193326
TypeSmall organic molecule
Emp. Form.C18H30N5O5
Mol. Mass.396.4608
SMILESCC[n+]1cn([C@@H]2O[C@H](CO)[C@H](OC(C)C)C2OC(C)C)c2nc(N)[nH]c(=O)c12