Reaction Details
TargetEukaryotic translation initiation factor 4E
LigandBDBM50370491
Substrate/Competitorn/a
Meas. Tech.ChEMBL_305877 (CHEMBL831921)
IC50 130000±n/a nM
Citation Ghosh, PPark, CPeterson, MSBitterman, PBPolunovsky, VAWagner, CR Synthesis and evaluation of potential inhibitors of eIF4E cap binding to 7-methyl GTP. Bioorg Med Chem Lett15:2177-80 (2005) 
 
Eukaryotic translation initiation factor 4E
Name:Eukaryotic translation initiation factor 4E
Type:Protein
Mol. Mass.:25095.44
Organism:Homo sapiens (Human)
Description:P06730
Residue:217
BDBM50370491
NameBDBM50370491
Synonyms:CHEMBL611110
TypeSmall organic molecule
Emp. Form.C10H13N5O7P
Mol. Mass.346.2138
SMILESNc1nc2n(cnc2c(=O)[nH]1)C1O[C@H](COP([O-])=O)[C@@H](O)[C@H]1O