Reaction Details
TargetEukaryotic translation initiation factor 4E
LigandBDBM50410170
Substrate/Competitorn/a
Meas. Tech.ChEMBL_305877 (CHEMBL831921)
IC50 4000±n/a nM
Citation Ghosh, PPark, CPeterson, MSBitterman, PBPolunovsky, VAWagner, CR Synthesis and evaluation of potential inhibitors of eIF4E cap binding to 7-methyl GTP. Bioorg Med Chem Lett15:2177-80 (2005) 
 
Eukaryotic translation initiation factor 4E
Name:Eukaryotic translation initiation factor 4E
Type:Protein
Mol. Mass.:25095.44
Organism:Homo sapiens (Human)
Description:P06730
Residue:217
BDBM50410170
NameBDBM50410170
Synonyms:CHEMBL2079703
TypeSmall organic molecule
Emp. Form.C11H14N5O13P3
Mol. Mass.517.178
SMILESC[n+]1cn([C@H]2C[C@@H](O)[C@@H](COP([O-])(=O)OP([O-])(=O)OP([O-])([O-])=O)O2)c2nc([NH-])[nH]c(=O)c12