Reaction Details
TargetEukaryotic translation initiation factor 4E
LigandBDBM50410171
Substrate/Competitorn/a
Meas. Tech.ChEMBL_305877 (CHEMBL831921)
IC50 70000±n/a nM
Citation Ghosh, PPark, CPeterson, MSBitterman, PBPolunovsky, VAWagner, CR Synthesis and evaluation of potential inhibitors of eIF4E cap binding to 7-methyl GTP. Bioorg Med Chem Lett15:2177-80 (2005) 
 
Eukaryotic translation initiation factor 4E
Name:Eukaryotic translation initiation factor 4E
Type:Protein
Mol. Mass.:25095.44
Organism:Homo sapiens (Human)
Description:P06730
Residue:217
BDBM50410171
NameBDBM50410171
Synonyms:CHEMBL2079700
TypeSmall organic molecule
Emp. Form.C27H35N5O7P
Mol. Mass.572.5704
SMILESCC(C)O[C@H]1[C@@H](COP([O-])=O)O[C@H](C1OC(C)C)n1c[n+](Cc2ccccccccc2)c2c1nc([NH-])[nH]c2=O