Reaction Details
TargetNitric oxide synthase, inducible
LigandBDBM50346613
Substrate/Competitorn/a
Meas. Tech.ChEMBL_305519 (CHEMBL827657)
IC50 37000±n/a nM
Citation Couch, RDBrowning, RGHonda, TGribble, GWWright, DLSporn, MBAnderson, AC Studies on the reactivity of CDDO, a promising new chemopreventive and chemotherapeutic agent: implications for a molecular mechanism of action. Bioorg Med Chem Lett15:2215-9 (2005) 
 
Nitric oxide synthase, inducible
Name:Nitric oxide synthase, inducible
Type:Homodimer
Mol. Mass.:131141.95
Organism:Homo sapiens (Human)
Description:P35228
Residue:1153
BDBM50346613
NameBDBM50346613
Synonyms:CHEMBL470029 | Oleanonic Acid
TypeSmall organic molecule
Emp. Form.C30H46O3
Mol. Mass.454.6844
SMILESCC1(C)CC[C@@]2(CC[C@]3(C)C(=CC[C@@H]4[C@@]5(C)CCC(=O)C(C)(C)[C@@H]5CC[C@@]34C)[C@@H]2C1)C(O)=O