Reaction Details
TargetSteryl-sulfatase
LigandBDBM50151136
Substrate/Competitorn/a
Meas. Tech.ChEMBL_302762 (CHEMBL838826)
Ki>50000±n/a nM
Citation Horvath, ANussbaumer, PWolff, BBillich, A 2-(1-adamantyl)-4-(thio)chromenone-6-carboxylic acids: potent reversible inhibitors of human steroid sulfatase. J Med Chem47:4268-76 (2004) 
 
Steryl-sulfatase
Name:Steryl-sulfatase
Type:Enzyme
Mol. Mass.:65503.66
Organism:Homo sapiens (Human)
Description:P08842
Residue:583
BDBM50151136
NameBDBM50151136
Synonyms:2-Adamantan-1-yl-4-oxo-4H-thiochromene-6-carbonitrile | CHEMBL361700
TypeSmall organic molecule
Emp. Form.C20H19NOS
Mol. Mass.321.436
SMILESO=c1cc(sc2ccc(cc12)C#N)C12CC3CC(CC(C3)C1)C2