Reaction Details
TargetSteryl-sulfatase
LigandBDBM50151142
Substrate/Competitorn/a
Meas. Tech.ChEMBL_302762 (CHEMBL838826)
Ki 500±n/a nM
Citation Horvath, ANussbaumer, PWolff, BBillich, A 2-(1-adamantyl)-4-(thio)chromenone-6-carboxylic acids: potent reversible inhibitors of human steroid sulfatase. J Med Chem47:4268-76 (2004) 
 
Steryl-sulfatase
Name:Steryl-sulfatase
Type:Enzyme
Mol. Mass.:65503.66
Organism:Homo sapiens (Human)
Description:P08842
Residue:583
BDBM50151142
NameBDBM50151142
Synonyms:2-Adamantan-1-yl-4-oxo-4H-chromene-6-carboxylic acid | CHEMBL184540
TypeSmall organic molecule
Emp. Form.C20H20O4
Mol. Mass.324.3704
SMILESOC(=O)c1ccc2oc(cc(=O)c2c1)C12CC3CC(CC(C3)C1)C2