Reaction Details
TargetMuscarinic acetylcholine receptor M1
LigandBDBM50151219
Substrate/Competitorn/a
Meas. Tech.ChEMBL_302248 (CHEMBL830264)
Kd 36±n/a nM
Citation Tahtaoui, CParrot, IKlotz, PGuillier, FGalzi, JLHibert, MIlien, B Fluorescent pirenzepine derivatives as potential bitopic ligands of the human M1 muscarinic receptor. J Med Chem47:4300-15 (2004) 
 
Muscarinic acetylcholine receptor M1
Name:Muscarinic acetylcholine receptor M1
Type:Protein
Mol. Mass.:51442.54
Organism:Homo sapiens (Human)
Description:P11229
Residue:460
BDBM50151219
NameBDBM50151219
Synonyms:(2E)-2-[(2E)-3-[3,3-dimethyl-1-(5-{[2-(2-{2-[4-(2-oxo-2-{10-oxo-2,4,9-triazatricyclo[9.4.0.0^{3,8}]pentadeca-1(11),3(8),4,6,12,14-hexaen-2-yl}ethyl)piperazin-1-yl]ethoxy}ethoxy)ethyl]carbamoyl}pentyl)-5-sulfonato-2,3-dihydro-1H-indol-2-yl]prop-2-en-1-ylidene]-1-ethyl-3,3-dimethyl-2,3-dihydro-1H-indole-5-sulfonate Cy3 derivative of pirenzepine, Cy3(15)PZ
TypeSmall organic molecule
Emp. Form.C55H68N8O11S2
Mol. Mass.1081.307
SMILESCCN1\C(=C\C=C\C2N(CCCCCC(=O)NCCOCCOCCN3CCN(CC(=O)N4c5ccccc5C(=O)Nc5cccnc45)CC3)c3ccc(cc3C2(C)C)S([O-])(=O)=O)C(C)(C)c2cc(ccc12)S([O-])(=O)=O