Reaction Details
TargetAdenosine receptor A3
LigandBDBM50152071
Substrate/Competitorn/a
Meas. Tech.ChEMBL_303007 (CHEMBL830246)
Ki 3±n/a nM
Citation Elzein, EPalle, VWu, YMaa, TZeng, DZablocki, J 2-Pyrazolyl-N(6)-substituted adenosine derivatives as high affinity and selective adenosine A(3) receptor agonists. J Med Chem47:4766-73 (2004) 
 
Adenosine receptor A3
Name:Adenosine receptor A3
Type:G Protein-Coupled Receptor (GPCR)
Mol. Mass.:36197.32
Organism:Homo sapiens (Human)
Description:P0DMS8
Residue:318
BDBM50152071
NameBDBM50152071
Synonyms:2-Hydroxymethyl-5-[6-methylamino-2-(4-quinolin-2-yl-pyrazol-1-yl)-purin-9-yl]-tetrahydro-furan-3,4-diol | CHEMBL183940
TypeSmall organic molecule
Emp. Form.C23H22N8O4
Mol. Mass.474.472
SMILESCNc1nc(nc2n(cnc12)C1O[C@H](CO)[C@@H](O)[C@H]1O)-n1cc(cn1)-c1ccc2ccccc2n1