Reaction Details
TargetAdenosine receptor A3
LigandBDBM50152074
Substrate/Competitorn/a
Meas. Tech.ChEMBL_303007 (CHEMBL830246)
Ki 73±n/a nM
Citation Elzein, EPalle, VWu, YMaa, TZeng, DZablocki, J 2-Pyrazolyl-N(6)-substituted adenosine derivatives as high affinity and selective adenosine A(3) receptor agonists. J Med Chem47:4766-73 (2004) 
 
Adenosine receptor A3
Name:Adenosine receptor A3
Type:G Protein-Coupled Receptor (GPCR)
Mol. Mass.:36197.32
Organism:Homo sapiens (Human)
Description:P0DMS8
Residue:318
BDBM50152074
NameBDBM50152074
Synonyms:1-[9-(3,4-Dihydroxy-5-hydroxymethyl-tetrahydro-furan-2-yl)-6-methylamino-9H-purin-2-yl]-1H-pyrazole-4-carboxylic acid methylamide | CHEMBL426436
TypeSmall organic molecule
Emp. Form.C16H20N8O5
Mol. Mass.404.3806
SMILESCNC(=O)c1cnn(c1)-c1nc(NC)c2ncn(C3O[C@H](CO)[C@@H](O)[C@H]3O)c2n1