Reaction Details
TargetAdenosine receptor A1
LigandBDBM50152076
Substrate/Competitorn/a
Meas. Tech.ChEMBL_302928 (CHEMBL830387)
Ki 4200±n/a nM
Citation Elzein, EPalle, VWu, YMaa, TZeng, DZablocki, J 2-Pyrazolyl-N(6)-substituted adenosine derivatives as high affinity and selective adenosine A(3) receptor agonists. J Med Chem47:4766-73 (2004) 
 
Adenosine receptor A1
Name:Adenosine receptor A1
Type:G Protein-Coupled Receptor (GPCR)
Mol. Mass.:36520.92
Organism:Homo sapiens (Human)
Description:P30542
Residue:326
BDBM50152076
NameBDBM50152076
Synonyms:2-Hydroxymethyl-5-[6-(3-iodo-benzylamino)-2-(4-pyridin-2-yl-pyrazol-1-yl)-purin-9-yl]-tetrahydro-furan-3,4-diol | CHEMBL362117
TypeSmall organic molecule
Emp. Form.C25H23IN8O4
Mol. Mass.626.4058
SMILESOC[C@H]1OC([C@H](O)[C@@H]1O)n1cnc2c(NCc3cccc(I)c3)nc(nc12)-n1cc(cn1)-c1ccccn1