Reaction Details
TargetAdenosine receptor A2a
LigandBDBM50152069
Substrate/Competitorn/a
Meas. Tech.ChEMBL_303026 (CHEMBL876372)
Ki>5000±n/a nM
Citation Elzein, EPalle, VWu, YMaa, TZeng, DZablocki, J 2-Pyrazolyl-N(6)-substituted adenosine derivatives as high affinity and selective adenosine A(3) receptor agonists. J Med Chem47:4766-73 (2004) 
 
Adenosine receptor A2a
Name:Adenosine receptor A2a
Type:G Protein-Coupled Receptor (GPCR)
Mol. Mass.:44716.46
Organism:Homo sapiens (Human)
Description:P29274
Residue:412
BDBM50152069
NameBDBM50152069
Synonyms:2-[2-(1-Benzyl-1H-pyrazol-4-yl)-6-methylamino-purin-9-yl]-5-hydroxymethyl-tetrahydro-furan-3,4-diol | CHEMBL359991
TypeSmall organic molecule
Emp. Form.C21H23N7O4
Mol. Mass.437.4518
SMILESCNc1nc(nc2n(cnc12)C1O[C@H](CO)[C@@H](O)[C@H]1O)-c1cnn(Cc2ccccc2)c1