Reaction Details
TargetAdenosine receptor A1
LigandBDBM50152075
Substrate/Competitorn/a
Meas. Tech.ChEMBL_302928 (CHEMBL830387)
Ki>6000±n/a nM
Citation Elzein, EPalle, VWu, YMaa, TZeng, DZablocki, J 2-Pyrazolyl-N(6)-substituted adenosine derivatives as high affinity and selective adenosine A(3) receptor agonists. J Med Chem47:4766-73 (2004) 
 
Adenosine receptor A1
Name:Adenosine receptor A1
Type:G Protein-Coupled Receptor (GPCR)
Mol. Mass.:36520.92
Organism:Homo sapiens (Human)
Description:P30542
Residue:326
BDBM50152075
NameBDBM50152075
Synonyms:2-{2-[4-(4-Chloro-phenyl)-pyrazol-1-yl]-6-methylamino-purin-9-yl}-5-hydroxymethyl-tetrahydro-furan-3,4-diol | CHEMBL365642
TypeSmall organic molecule
Emp. Form.C20H20ClN7O4
Mol. Mass.457.87
SMILESCNc1nc(nc2n(cnc12)C1O[C@H](CO)[C@@H](O)[C@H]1O)-n1cc(cn1)-c1ccc(Cl)cc1