Reaction Details
TargetAdenosine receptor A3
LigandBDBM50152092
Substrate/Competitorn/a
Meas. Tech.ChEMBL_303007 (CHEMBL830246)
Ki 320±n/a nM
Citation Elzein, EPalle, VWu, YMaa, TZeng, DZablocki, J 2-Pyrazolyl-N(6)-substituted adenosine derivatives as high affinity and selective adenosine A(3) receptor agonists. J Med Chem47:4766-73 (2004) 
 
Adenosine receptor A3
Name:Adenosine receptor A3
Type:G Protein-Coupled Receptor (GPCR)
Mol. Mass.:36197.32
Organism:Homo sapiens (Human)
Description:P0DMS8
Residue:318
BDBM50152092
NameBDBM50152092
Synonyms:2-Hydroxymethyl-5-{6-(3-iodo-benzylamino)-2-[4-(4-methoxy-phenyl)-pyrazol-1-yl]-purin-9-yl}-tetrahydro-furan-3,4-diol | CHEMBL361075
TypeSmall organic molecule
Emp. Form.C27H26IN7O5
Mol. Mass.655.4437
SMILESCOc1ccc(cc1)-c1cnn(c1)-c1nc(NCc2cccc(I)c2)c2ncn(C3O[C@H](CO)[C@@H](O)[C@H]3O)c2n1