Reaction Details
TargetAdenosine receptor A2a
LigandBDBM50152091
Substrate/Competitorn/a
Meas. Tech.ChEMBL_303026 (CHEMBL876372)
Ki 52±n/a nM
Citation Elzein, EPalle, VWu, YMaa, TZeng, DZablocki, J 2-Pyrazolyl-N(6)-substituted adenosine derivatives as high affinity and selective adenosine A(3) receptor agonists. J Med Chem47:4766-73 (2004) 
 
Adenosine receptor A2a
Name:Adenosine receptor A2a
Type:G Protein-Coupled Receptor (GPCR)
Mol. Mass.:44716.46
Organism:Homo sapiens (Human)
Description:P29274
Residue:412
BDBM50152091
NameBDBM50152091
Synonyms:2-Hydroxymethyl-5-[6-(3-iodo-benzylamino)-2-(4-isoquinolin-1-yl-pyrazol-1-yl)-purin-9-yl]-tetrahydro-furan-3,4-diol | CHEMBL363458
TypeSmall organic molecule
Emp. Form.C29H25IN8O4
Mol. Mass.676.4645
SMILESOC[C@H]1OC([C@H](O)[C@@H]1O)n1cnc2c(NCc3cccc(I)c3)nc(nc12)-n1cc(cn1)-c1nccc2ccccc12