Reaction Details
TargetAdenosine receptor A2a
LigandBDBM50152088
Substrate/Competitorn/a
Meas. Tech.ChEMBL_303026 (CHEMBL876372)
Ki 1.5±n/a nM
Citation Elzein, EPalle, VWu, YMaa, TZeng, DZablocki, J 2-Pyrazolyl-N(6)-substituted adenosine derivatives as high affinity and selective adenosine A(3) receptor agonists. J Med Chem47:4766-73 (2004) 
 
Adenosine receptor A2a
Name:Adenosine receptor A2a
Type:G Protein-Coupled Receptor (GPCR)
Mol. Mass.:44716.46
Organism:Homo sapiens (Human)
Description:P29274
Residue:412
BDBM50152088
NameBDBM50152088
Synonyms:2-[6-Amino-2-(1-benzyl-1H-pyrazol-4-yl)-purin-9-yl]-5-hydroxymethyl-tetrahydro-furan-3,4-diol | CHEMBL187326
TypeSmall organic molecule
Emp. Form.C20H21N7O4
Mol. Mass.423.4252
SMILESNc1nc(nc2n(cnc12)C1O[C@H](CO)[C@@H](O)[C@H]1O)-c1cnn(Cc2ccccc2)c1