Reaction Details
TargetAdenosine receptor A2a
LigandBDBM50152086
Substrate/Competitorn/a
Meas. Tech.ChEMBL_303026 (CHEMBL876372)
Ki>5000±n/a nM
Citation Elzein, EPalle, VWu, YMaa, TZeng, DZablocki, J 2-Pyrazolyl-N(6)-substituted adenosine derivatives as high affinity and selective adenosine A(3) receptor agonists. J Med Chem47:4766-73 (2004) 
 
Adenosine receptor A2a
Name:Adenosine receptor A2a
Type:G Protein-Coupled Receptor (GPCR)
Mol. Mass.:44716.46
Organism:Homo sapiens (Human)
Description:P29274
Residue:412
BDBM50152086
NameBDBM50152086
Synonyms:2-Hydroxymethyl-5-[6-methylamino-2-(4-pyridin-2-yl-pyrazol-1-yl)-purin-9-yl]-tetrahydro-furan-3,4-diol | CHEMBL186729
TypeSmall organic molecule
Emp. Form.C19H20N8O4
Mol. Mass.424.4133
SMILESCNc1nc(nc2n(cnc12)C1O[C@H](CO)[C@@H](O)[C@H]1O)-n1cc(cn1)-c1ccccn1