Reaction Details
TargetDelta-type opioid receptor
LigandBDBM50154200
Substrate/Competitorn/a
Meas. Tech.ChEMBL_303501 (CHEMBL839973)
Ki 2430±n/a nM
Citation Grundt, PWilliams, IALewis, JWHusbands, SM Identification of a new scaffold for opioid receptor antagonism based on the 2-amino-1,1-dimethyl-7-hydroxytetralin pharmacophore. J Med Chem47:5069-75 (2004) 
 
Delta-type opioid receptor
Name:Delta-type opioid receptor
Type:G Protein-Coupled Receptor (GPCR)
Mol. Mass.:40382.98
Organism:Homo sapiens (Human)
Description:Competition binding assays were carried out using membrane preparations from transfected HN9.10 cells that constitutively expressed the delta opioid receptor.
Residue:372
BDBM50154200
NameBDBM50154200
Synonyms:7-amino-6-methoxy-8,8-dimethyl-5,6,7,8-tetrahydronaphthalen-2-ol | CHEMBL187635
TypeSmall organic molecule
Emp. Form.C13H19NO2
Mol. Mass.221.2955
SMILESCO[C@H]1Cc2ccc(O)cc2C(C)(C)[C@@H]1N