Reaction Details
TargetCarbonic anhydrase 1
LigandBDBM50154317
Substrate/Competitorn/a
Meas. Tech.ChEMBL_302403 (CHEMBL875202)
Ki 58±n/a nM
Citation Innocenti, ACasini, AAlcaro, MCPapini, AMScozzafava, ASupuran, CT Carbonic anhydrase inhibitors: the first on-resin screening of a 4-sulfamoylphenylthiourea library. J Med Chem47:5224-9 (2004) 
 
Carbonic anhydrase 1
Name:Carbonic anhydrase 1
Type:Enzyme
Mol. Mass.:28873.37
Organism:Homo sapiens (Human)
Description:P00915
Residue:261
BDBM50154317
NameBDBM50154317
Synonyms:(S)-2-[3-(4-Sulfamoyl-phenyl)-thioureido]-propionic acid 4-methylcarbamoylmethoxy-benzyl with resin | CHEMBL362345
TypeSmall organic molecule
Emp. Form.C20H24N4O6S2
Mol. Mass.480.558
SMILESCNC(=O)COc1ccc(COC(=O)[C@H](C)NC(=S)Nc2ccc(cc2)S(N)(=O)=O)cc1