Reaction Details
TargetCarbonic anhydrase 2
LigandBDBM50154319
Substrate/Competitorn/a
Meas. Tech.ChEMBL_302417 (CHEMBL828821)
Ki 12±n/a nM
Citation Innocenti, ACasini, AAlcaro, MCPapini, AMScozzafava, ASupuran, CT Carbonic anhydrase inhibitors: the first on-resin screening of a 4-sulfamoylphenylthiourea library. J Med Chem47:5224-9 (2004) 
 
Carbonic anhydrase 2
Name:Carbonic anhydrase 2
Type:Enzyme
Mol. Mass.:29250.71
Organism:Homo sapiens (Human)
Description:P00918
Residue:260
BDBM50154319
NameBDBM50154319
Synonyms:(S)-2-[3-(4-Sulfamoyl-phenyl)-thioureido]-propionic acid | CHEMBL189294
TypeSmall organic molecule
Emp. Form.C10H13N3O4S2
Mol. Mass.303.358
SMILESC[C@H](NC(=S)Nc1ccc(cc1)S(N)(=O)=O)C(O)=O