Reaction Details
TargetCarbonic anhydrase 2
LigandBDBM50154321
Substrate/Competitorn/a
Meas. Tech.ChEMBL_302417 (CHEMBL828821)
Ki 5±n/a nM
Citation Innocenti, ACasini, AAlcaro, MCPapini, AMScozzafava, ASupuran, CT Carbonic anhydrase inhibitors: the first on-resin screening of a 4-sulfamoylphenylthiourea library. J Med Chem47:5224-9 (2004) 
 
Carbonic anhydrase 2
Name:Carbonic anhydrase 2
Type:Enzyme
Mol. Mass.:29250.71
Organism:Homo sapiens (Human)
Description:P00918
Residue:260
BDBM50154321
NameBDBM50154321
Synonyms:(S)-4-Methylsulfanyl-2-[3-(4-sulfamoyl-phenyl)-thioureido]-butyric acid methylcarbamoylmethyl with resin | CHEMBL361026
TypeSmall organic molecule
Emp. Form.C15H22N4O5S3
Mol. Mass.434.554
SMILESCNC(=O)COC(=O)[C@H](CCSC)NC(=S)Nc1ccc(cc1)S(N)(=O)=O