Reaction Details
TargetCarbonic anhydrase 2
LigandBDBM50154326
Substrate/Competitorn/a
Meas. Tech.ChEMBL_302417 (CHEMBL828821)
Ki 9±n/a nM
Citation Innocenti, ACasini, AAlcaro, MCPapini, AMScozzafava, ASupuran, CT Carbonic anhydrase inhibitors: the first on-resin screening of a 4-sulfamoylphenylthiourea library. J Med Chem47:5224-9 (2004) 
 
Carbonic anhydrase 2
Name:Carbonic anhydrase 2
Type:Enzyme
Mol. Mass.:29250.71
Organism:Homo sapiens (Human)
Description:P00918
Residue:260
BDBM50154326
NameBDBM50154326
Synonyms:(S)-4-Carbamoyl-2-[3-(4-sulfamoyl-phenyl)-thioureido]-butyric acid | CHEMBL189079
TypeSmall organic molecule
Emp. Form.C12H16N4O5S2
Mol. Mass.360.409
SMILESNC(=O)CC[C@H](NC(=S)Nc1ccc(cc1)S(N)(=O)=O)C(O)=O