Reaction Details
TargetCarbonic anhydrase 2
LigandBDBM50154324
Substrate/Competitorn/a
Meas. Tech.ChEMBL_302417 (CHEMBL828821)
Ki 11±n/a nM
Citation Innocenti, ACasini, AAlcaro, MCPapini, AMScozzafava, ASupuran, CT Carbonic anhydrase inhibitors: the first on-resin screening of a 4-sulfamoylphenylthiourea library. J Med Chem47:5224-9 (2004) 
 
Carbonic anhydrase 2
Name:Carbonic anhydrase 2
Type:Enzyme
Mol. Mass.:29250.71
Organism:Homo sapiens (Human)
Description:P00918
Residue:260
BDBM50154324
NameBDBM50154324
Synonyms:4-Carbamoyl-2-[3-(4-sulfamoyl-phenyl)-thioureido]-butyric acid (S)-methylcarbamoylmethyl with resin | CHEMBL187896
TypeSmall organic molecule
Emp. Form.C15H21N5O6S2
Mol. Mass.431.487
SMILESCNC(=O)COC(=O)[C@H](CCC(N)=O)NC(=S)Nc1ccc(cc1)S(N)(=O)=O