Reaction Details
TargetAdenosylhomocysteinase
LigandBDBM50370520
Substrate/Competitorn/a
Meas. Tech.ChEMBL_302948 (CHEMBL841783)
Ki 550±n/a nM
Citation Wnuk, SFLewandowska, ESacasa, PRCrain, LNZhang, JBorchardt, RTDe Clercq, E Stereoselective synthesis of sugar-modified enyne analogues of adenosine and uridine. Interaction with S-adenosyl-L-homocysteine hydrolase and antiviral and cytotoxic effects. J Med Chem47:5251-7 (2004) 
 
Adenosylhomocysteinase
Name:Adenosylhomocysteinase
Type:PROTEIN
Mol. Mass.:47714.06
Organism:Homo sapiens (Human)
Description:ChEMBL_1507791
Residue:432
BDBM50370520
NameBDBM50370520
Synonyms:CHEMBL611098
TypeSmall organic molecule
Emp. Form.C13H13N5O3
Mol. Mass.287.274
SMILESNc1ncnc2n(cnc12)C1O[C@H](\C=C\C#C)[C@@H](O)[C@H]1O