Reaction Details
TargetType-2 angiotensin II receptor
LigandBDBM50156177
Substrate/Competitorn/a
Meas. Tech.ChEMBL_303706 (CHEMBL829041)
Ki 3.7±n/a nM
Citation Johannesson, PErdélyi, MLindeberg, GFrändberg, PANyberg, FKarlén, AHallberg, A AT2-selective angiotensin II analogues containing tyrosine-functionalized 5,5-bicyclic thiazabicycloalkane dipeptide mimetics. J Med Chem47:6009-19 (2004) 
 
Type-2 angiotensin II receptor
Name:Type-2 angiotensin II receptor
Type:Enzyme Catalytic Domain
Mol. Mass.:41201.61
Organism:Homo sapiens (Human)
Description:Angiotensin II, central 0 0::P50052
Residue:363
BDBM50156177
NameBDBM50156177
Synonyms:(2R,5R,7aR)-6-[2-((S)-Acetylamino)-3-methyl-butyrylamino]-6-benzyl-5-oxo-hexahydro-pyrrolo[2,1-b]thiazole-3-carboxylic acid [(S)-2-(1H-imidazol-4-yl)-1-methylcarbamoyl-ethyl]-amide | CHEMBL190286
TypeSmall organic molecule
Emp. Form.C28H37N7O6S
Mol. Mass.599.702
SMILESCNC(=O)[C@H](Cc1cnc[nH]1)NC(=O)[C@@H]1CS[C@@H]2C[C@@](Cc3ccc(O)cc3)(NC(=O)[C@@H](NC(C)=O)C(C)C)C(=O)N12