Reaction Details
TargetAcetylcholinesterase
LigandBDBM50158583
Substrate/Competitorn/a
Meas. Tech.ChEMBL_302891 (CHEMBL830207)
Ki 894±n/a nM
Citation Bolognesi, MLAndrisano, VBartolini, MBanzi, RMelchiorre, C Propidium-based polyamine ligands as potent inhibitors of acetylcholinesterase and acetylcholinesterase-induced amyloid-beta aggregation. J Med Chem48:24-7 (2005) 
 
Acetylcholinesterase
Name:Acetylcholinesterase
Type:Enzyme
Mol. Mass.:67792.70
Organism:Homo sapiens (Human)
Description:P22303
Residue:614
BDBM50158583
NameBDBM50158583
Synonyms:3,8-Diamino-5-{3-[3-({3-[(2-methoxy-benzyl)-methyl-amino]-propyl}-methyl-amino)-propylamino]-propyl}-6-phenyl-phenanthridinium CHEMBL361165
TypeSmall organic molecule
Emp. Form.C38H49N6O
Mol. Mass.605.8347
SMILESCOc1ccccc1CN(C)CCCN(C)CCCNCCCn1c(-c2ccccc2)c2cc(N)ccc2c2ccc(=[NH2+])cc12