Reaction Details
TargetCholinesterase
LigandBDBM31904
Substrate/Competitorn/a
Meas. Tech.ChEMBL_305392 (CHEMBL877000)
IC50 13200±n/a nM
Citation Bolognesi, MLAndrisano, VBartolini, MBanzi, RMelchiorre, C Propidium-based polyamine ligands as potent inhibitors of acetylcholinesterase and acetylcholinesterase-induced amyloid-beta aggregation. J Med Chem48:24-7 (2005) 
 
Cholinesterase
Name:Cholinesterase
Type:Homotetramer
Mol. Mass.:68422.27
Organism:Homo sapiens (Human)
Description:P06276
Residue:602
BDBM31904
NameBDBM31904
Synonyms:CHEMBL345124 Propidium Iodide, 2 | propidium iodide
TypeSmall organic molecule
Emp. Form.C27H34N4
Mol. Mass.414.5846
SMILESCC[N+](C)(CC)CCCn1c(-c2ccccc2)c2cc(N)ccc2c2ccc(=[NH2+])cc12