Reaction Details
TargetComplement C3
LigandBDBM50159038
Substrate/Competitorn/a
Meas. Tech.ChEMBL_305250 (CHEMBL833507)
IC50 136200±n/a nM
Citation Mallik, BKatragadda, MSpruce, LACarafides, CTsokos, CGMorikis, DLambris, JD Design and NMR characterization of active analogues of compstatin containing non-natural amino acids. J Med Chem48:274-86 (2005) 
 
Complement C3
Name:Complement C3
Type:Enzyme
Mol. Mass.:187142.34
Organism:Homo sapiens (Human)
Description:P01024
Residue:1663
BDBM50159038
NameBDBM50159038
Synonyms:Ac-I[CVWQDWGAdHRC]T | CHEMBL264596
TypeSmall organic molecule
Emp. Form.C71H99N21O19S2
Mol. Mass.1614.805
SMILESCC[C@H](C)[C@H](NC(C)=O)C(=O)N[C@H]1CSSC[C@H](NC(=O)[C@H](CCCNC(N)=N)NC(=O)[C@H](Cc2cnc[nH]2)NC(=O)[C@H](C)NC(=O)CNC(=O)[C@H](Cc2c[nH]c3ccccc23)NC(=O)[C@@H](CC(O)=O)NC(=O)[C@H](CCC(N)=O)NC(=O)[C@@H](Cc2c[nH]c3ccccc23)NC(=O)[C@@H](NC1=O)C(C)C)C(=O)N[C@H]([C@@H](C)O)C(O)=O